{"text_format":"1","workbook":"xlsx","n_sheets":8,"sheets":["BB","Bandits","Outlaws","Young Lions","Semi Pro","Masters","Pro","Point Values"],"not_rendered":{"charts":0,"images":0,"macros":0,"external_links":0,"defined_names":0,"comments":0,"pivot_tables":0},"unopened":[],"bounds":{"document_bytes":16777216,"sheet_cells":100000,"rows_first":2000,"rows_last":500,"rows_between":2000,"halvings":0,"cell_chars":16384,"cell_head_chars":4096},"cells_cut":0,"cells_raw":0,"read":"whole","date_system":"1900"}

{"sheet":"BB","index":0,"n_rows":22,"n_cols":13,"rows_kept":22,"cut":false,"hidden":false,"merged":[[0,0,0,14]]}
["BEGINNER BANDO - 2018 WINTER HEAT POINTS"]
[null,"CAR NUMBER","DRIVERS NAME","HOME TOWN",null,"2017-12-16","2017-12-16","2017-12-17","2018-01-21","2018-01-21","2018-01-27","2018-02-03","CANCELED"]
[1,"1","Nate Honeycutt",null,null,"X","X","X"]
[2,"8","Griffin Taylor",null,null,"1","1","1"]
[3,"9","Mykenzie Cozart",null,null,"X","X","X"]
[4,12,"Natasha Elder",null,null,null,null,"X","1","1"]
[5,"18","Alex Meggs",null,null,"X","X","X"]
[6,21,"Carter Russo",null,null,"X","X","X"]
{"$rows_left_out":15}
{"sheet":"Bandits","index":1,"n_rows":23,"n_cols":22,"rows_kept":23,"cut":false,"hidden":false,"merged":[[0,0,0,23],[22,0,22,21]]}
["BANDIT - 2018 WINTER HEAT POINTS"]
["CHAMPIONSHIP STANDING","CAR NUMBER","DRIVERS NAME",null,"TOTAL POINTS","2017-12-16","2017-12-17","2018-01-21","2018-01-21","2018-01-27","2018-01-27","2018-02-03","CANCELED",null,"2017-12-16","2017-12-17","2017-01-20","2018-01-20","2018-01-27","2018-01-27","2018-02-03","CANCELED"]
[1,19,"Jaiden Reyna",null,{"$f":"SUM(O3:U3)","v":582},8,3,2,2,3,1,1,null,null,0,{"$f":"VLOOKUP(G3,'Point Values'!$A:$B,2,FALSE)","v":94},{"$f":"VLOOKUP(H3,'Point Values'!$A:$B,2,FALSE)","v":97},{"$f":"VLOOKUP(I3,'Point Values'!$A:$B,2,FALSE)","v":97},{"$f":"VLOOKUP(J3,'Point Values'!$A:$B,2,FALSE)","v":94},{"$f":"VLOOKUP(K3,'Point Values'!$A:$B,2,FALSE)","v":100},{"$f":"VLOOKUP(L3,'Point Values'!$A:$B,2,FALSE)","v":100}]
[2,48,"Bobby Elder",null,567,4,4,3,".",2,2,2,null,null,{"$f":"VLOOKUP(F4,'Point Values'!$A:$B,2,FALSE)","v":91},{"$f":"VLOOKUP(G4,'Point Values'!$A:$B,2,FALSE)","v":91},{"$f":"VLOOKUP(H4,'Point Values'!$A:$B,2,FALSE)","v":94},{"$f":"VLOOKUP(I4,'Point Values'!$A:$B,2,FALSE)","v":0},{"$f":"VLOOKUP(J4,'Point Values'!$A:$B,2,FALSE)","v":97},{"$f":"VLOOKUP(K4,'Point Values'!$A:$B,2,FALSE)","v":97},{"$f":"VLOOKUP(L4,'Point Values'!$A:$B,2,FALSE)","v":97}]
[3,"74","Lucas Vera",null,546,9,".",7,3,1,3,3,null,null,{"$f":"VLOOKUP(F5,'Point Values'!$A:$B,2,FALSE)","v":80},{"$f":"VLOOKUP(G5,'Point Values'!$A:$B,2,FALSE)","v":0},{"$f":"VLOOKUP(H5,'Point Values'!$A:$B,2,FALSE)","v":84},{"$f":"VLOOKUP(I5,'Point Values'!$A:$B,2,FALSE)","v":94},{"$f":"VLOOKUP(J5,'Point Values'!$A:$B,2,FALSE)","v":100},{"$f":"VLOOKUP(K5,'Point Values'!$A:$B,2,FALSE)","v":94},{"$f":"VLOOKUP(L5,'Point Values'!$A:$B,2,FALSE)","v":94}]
[4,"18","Truett Miranda",null,535,5,5,4,4,4,5,6,null,null,0,{"$f":"VLOOKUP(G6,'Point Values'!$A:$B,2,FALSE)","v":88},{"$f":"VLOOKUP(H6,'Point Values'!$A:$B,2,FALSE)","v":91},{"$f":"VLOOKUP(I6,'Point Values'!$A:$B,2,FALSE)","v":91},{"$f":"VLOOKUP(J6,'Point Values'!$A:$B,2,FALSE)","v":91},{"$f":"VLOOKUP(K6,'Point Values'!$A:$B,2,FALSE)","v":88},{"$f":"VLOOKUP(L6,'Point Values'!$A:$B,2,FALSE)","v":86}]
[5,88,"Sean Abell",null,443,".",".",5,5,5,4,5,null,null,{"$f":"VLOOKUP(F7,'Point Values'!$A:$B,2,FALSE)","v":0},{"$f":"VLOOKUP(G7,'Point Values'!$A:$B,2,FALSE)","v":0},{"$f":"VLOOKUP(H7,'Point Values'!$A:$B,2,FALSE)","v":88},{"$f":"VLOOKUP(I7,'Point Values'!$A:$B,2,FALSE)","v":88},{"$f":"VLOOKUP(J7,'Point Values'!$A:$B,2,FALSE)","v":88},{"$f":"VLOOKUP(K7,'Point Values'!$A:$B,2,FALSE)","v":91},{"$f":"VLOOKUP(L7,'Point Values'!$A:$B,2,FALSE)","v":88}]
[6,"4E","Parker Eatmon",null,391,3,2,1,1,".",".",".",null,null,{"$f":"VLOOKUP(F8,'Point Values'!$A:$B,2,FALSE)","v":94},{"$f":"VLOOKUP(G8,'Point Values'!$A:$B,2,FALSE)","v":97},{"$f":"VLOOKUP(H8,'Point Values'!$A:$B,2,FALSE)","v":100},{"$f":"VLOOKUP(I8,'Point Values'!$A:$B,2,FALSE)","v":100},{"$f":"VLOOKUP(J8,'Point Values'!$A:$B,2,FALSE)","v":0},{"$f":"VLOOKUP(K8,'Point Values'!$A:$B,2,FALSE)","v":0},{"$f":"VLOOKUP(L8,'Point Values'!$A:$B,2,FALSE)","v":0}]
{"$rows_left_out":16}
{"sheet":"Outlaws","index":2,"n_rows":23,"n_cols":22,"rows_kept":23,"cut":false,"hidden":false,"merged":[[0,0,0,23],[22,0,22,21]]}
["OUTLAW - 2018 WINTER HEAT POINTS"]
["CHAMPIONSHIP STANDING","CAR NUMBER","DRIVERS NAME",null,"TOTAL POINTS","2017-12-16","2017-12-16","2018-01-21","2018-01-21","2018-01-27","2018-01-27","2018-02-03","CANCELED","2018-02-03","2017-12-16","2017-12-17","2017-01-20","2018-01-20","2018-01-27","2018-01-27","2018-02-03","CANCELED"]
[1,"6L","Garrett Lowe",null,{"$f":"SUM(O3:U3)","v":588},6,4,2,1,1,1,1,null,null,0,{"$f":"VLOOKUP(G3,'Point Values'!$A:$B,2,FALSE)","v":91},{"$f":"VLOOKUP(H3,'Point Values'!$A:$B,2,FALSE)","v":97},{"$f":"VLOOKUP(I3,'Point Values'!$A:$B,2,FALSE)","v":100},{"$f":"VLOOKUP(J3,'Point Values'!$A:$B,2,FALSE)","v":100},{"$f":"VLOOKUP(K3,'Point Values'!$A:$B,2,FALSE)","v":100},{"$f":"VLOOKUP(L3,'Point Values'!$A:$B,2,FALSE)","v":100}]
[2,"9","Santiago Hill",null,545,8,2,6,6,4,4,3,null,null,0,{"$f":"VLOOKUP(G4,'Point Values'!$A:$B,2,FALSE)","v":97},{"$f":"VLOOKUP(H4,'Point Values'!$A:$B,2,FALSE)","v":86},{"$f":"VLOOKUP(I4,'Point Values'!$A:$B,2,FALSE)","v":86},{"$f":"VLOOKUP(J4,'Point Values'!$A:$B,2,FALSE)","v":91},{"$f":"VLOOKUP(K4,'Point Values'!$A:$B,2,FALSE)","v":91},{"$f":"VLOOKUP(L4,'Point Values'!$A:$B,2,FALSE)","v":94}]
[3,"04","Cameron Murray",null,528,5,5,3,5,7,12,6,null,null,{"$f":"VLOOKUP(F5,'Point Values'!$A:$B,2,FALSE)","v":88},{"$f":"VLOOKUP(G5,'Point Values'!$A:$B,2,FALSE)","v":88},{"$f":"VLOOKUP(H5,'Point Values'!$A:$B,2,FALSE)","v":94},{"$f":"VLOOKUP(I5,'Point Values'!$A:$B,2,FALSE)","v":88},{"$f":"VLOOKUP(J5,'Point Values'!$A:$B,2,FALSE)","v":84},0,{"$f":"VLOOKUP(L5,'Point Values'!$A:$B,2,FALSE)","v":86}]
[4,24,"Jaydn Daniels",null,524,7,7,8,4,6,9,2,null,null,{"$f":"VLOOKUP(F6,'Point Values'!$A:$B,2,FALSE)","v":84},{"$f":"VLOOKUP(G6,'Point Values'!$A:$B,2,FALSE)","v":84},{"$f":"VLOOKUP(H6,'Point Values'!$A:$B,2,FALSE)","v":82},{"$f":"VLOOKUP(I6,'Point Values'!$A:$B,2,FALSE)","v":91},{"$f":"VLOOKUP(J6,'Point Values'!$A:$B,2,FALSE)","v":86},0,{"$f":"VLOOKUP(L6,'Point Values'!$A:$B,2,FALSE)","v":97}]
[5,"8","Trevor Wester",null,521,4,13,5,8,8,3,7,null,null,{"$f":"VLOOKUP(F7,'Point Values'!$A:$B,2,FALSE)","v":91},0,{"$f":"VLOOKUP(H7,'Point Values'!$A:$B,2,FALSE)","v":88},{"$f":"VLOOKUP(I7,'Point Values'!$A:$B,2,FALSE)","v":82},{"$f":"VLOOKUP(J7,'Point Values'!$A:$B,2,FALSE)","v":82},{"$f":"VLOOKUP(K7,'Point Values'!$A:$B,2,FALSE)","v":94},{"$f":"VLOOKUP(L7,'Point Values'!$A:$B,2,FALSE)","v":84}]
[6,"77","Carson Ramsey",null,516,1,3,11,12,5,6,13,null,null,{"$f":"VLOOKUP(F8,'Point Values'!$A:$B,2,FALSE)","v":100},{"$f":"VLOOKUP(G8,'Point Values'!$A:$B,2,FALSE)","v":94},{"$f":"VLOOKUP(H8,'Point Values'!$A:$B,2,FALSE)","v":76},0,{"$f":"VLOOKUP(J8,'Point Values'!$A:$B,2,FALSE)","v":88},{"$f":"VLOOKUP(K8,'Point Values'!$A:$B,2,FALSE)","v":86},{"$f":"VLOOKUP(L8,'Point Values'!$A:$B,2,FALSE)","v":72}]
{"$rows_left_out":16}
{"sheet":"Young Lions","index":3,"n_rows":28,"n_cols":22,"rows_kept":28,"cut":false,"hidden":false,"merged":[[0,0,0,23],[27,0,27,21]]}
["YOUNG LION - 2018 WINTER HEAT POINTS"]
["CHAMPIONSHIP STANDING","CAR NUMBER","DRIVERS NAME",null,"TOTAL POINTS","2017-12-16","2017-12-17","2017-01-13","2018-01-13","2018-01-20","2018-01-20","2018-01-27","2018-02-03",null,"2017-12-16","2017-12-17","2017-01-13","2018-01-13","2018-01-20","2018-01-20","2018-01-27","2018-02-03"]
[1,6,"Isaak Love",null,{"$f":"SUM(O3:V3)","v":682},1,5,6,1,3,1,1,1,null,{"$f":"VLOOKUP(F3,'Point Values'!$A:$B,2,FALSE)","v":100},{"$f":"VLOOKUP(G3,'Point Values'!$A:$B,2,FALSE)","v":88},0,{"$f":"VLOOKUP(I3,'Point Values'!$A:$B,2,FALSE)","v":100},{"$f":"VLOOKUP(J3,'Point Values'!$A:$B,2,FALSE)","v":94},{"$f":"VLOOKUP(K3,'Point Values'!$A:$B,2,FALSE)","v":100},{"$f":"VLOOKUP(L3,'Point Values'!$A:$B,2,FALSE)","v":100},{"$f":"VLOOKUP(M3,'Point Values'!$A:$B,2,FALSE)","v":100}]
[2,"52","Jak Crawford",null,673,2,3,2,3,1,3,3,2,null,{"$f":"VLOOKUP(F4,'Point Values'!$A:$B,2,FALSE)","v":97},0,{"$f":"VLOOKUP(H4,'Point Values'!$A:$B,2,FALSE)","v":97},{"$f":"VLOOKUP(I4,'Point Values'!$A:$B,2,FALSE)","v":94},{"$f":"VLOOKUP(J4,'Point Values'!$A:$B,2,FALSE)","v":100},{"$f":"VLOOKUP(K4,'Point Values'!$A:$B,2,FALSE)","v":94},{"$f":"VLOOKUP(L4,'Point Values'!$A:$B,2,FALSE)","v":94},{"$f":"VLOOKUP(M4,'Point Values'!$A:$B,2,FALSE)","v":97}]
[3,"22","Will Robusto",null,561,5,4,1,2,4,4,4,".",null,0,{"$f":"VLOOKUP(G5,'Point Values'!$A:$B,2,FALSE)","v":91},{"$f":"VLOOKUP(H5,'Point Values'!$A:$B,2,FALSE)","v":100},{"$f":"VLOOKUP(I5,'Point Values'!$A:$B,2,FALSE)","v":97},{"$f":"VLOOKUP(J5,'Point Values'!$A:$B,2,FALSE)","v":91},{"$f":"VLOOKUP(K5,'Point Values'!$A:$B,2,FALSE)","v":91},{"$f":"VLOOKUP(L5,'Point Values'!$A:$B,2,FALSE)","v":91},{"$f":"VLOOKUP(M5,'Point Values'!$A:$B,2,FALSE)","v":0}]
[4,"4","Leland Honeyman",null,557,13,1,".",".",2,2,2,3,null,{"$f":"VLOOKUP(F6,'Point Values'!$A:$B,2,FALSE)","v":72},{"$f":"VLOOKUP(G6,'Point Values'!$A:$B,2,FALSE)","v":100},{"$f":"VLOOKUP(H6,'Point Values'!$A:$B,2,FALSE)","v":0},{"$f":"VLOOKUP(I6,'Point Values'!$A:$B,2,FALSE)","v":0},{"$f":"VLOOKUP(J6,'Point Values'!$A:$B,2,FALSE)","v":97},{"$f":"VLOOKUP(K6,'Point Values'!$A:$B,2,FALSE)","v":97},{"$f":"VLOOKUP(L6,'Point Values'!$A:$B,2,FALSE)","v":97},{"$f":"VLOOKUP(M6,'Point Values'!$A:$B,2,FALSE)","v":94}]
[5,55,"Isabella Robusto",null,530,6,".",3,5,5,6,5,".",null,{"$f":"VLOOKUP(F7,'Point Values'!$A:$B,2,FALSE)","v":86},{"$f":"VLOOKUP(G7,'Point Values'!$A:$B,2,FALSE)","v":0},{"$f":"VLOOKUP(H7,'Point Values'!$A:$B,2,FALSE)","v":94},{"$f":"VLOOKUP(I7,'Point Values'!$A:$B,2,FALSE)","v":88},{"$f":"VLOOKUP(J7,'Point Values'!$A:$B,2,FALSE)","v":88},{"$f":"VLOOKUP(K7,'Point Values'!$A:$B,2,FALSE)","v":86},{"$f":"VLOOKUP(L7,'Point Values'!$A:$B,2,FALSE)","v":88},{"$f":"VLOOKUP(M7,'Point Values'!$A:$B,2,FALSE)","v":0}]
[6,"21T","Tristan Borkoski",null,498,12,7,9,6,6,5,".",".",null,{"$f":"VLOOKUP(F8,'Point Values'!$A:$B,2,FALSE)","v":74},{"$f":"VLOOKUP(G8,'Point Values'!$A:$B,2,FALSE)","v":84},{"$f":"VLOOKUP(H8,'Point Values'!$A:$B,2,FALSE)","v":80},{"$f":"VLOOKUP(I8,'Point Values'!$A:$B,2,FALSE)","v":86},{"$f":"VLOOKUP(J8,'Point Values'!$A:$B,2,FALSE)","v":86},{"$f":"VLOOKUP(K8,'Point Values'!$A:$B,2,FALSE)","v":88},{"$f":"VLOOKUP(L8,'Point Values'!$A:$B,2,FALSE)","v":0},{"$f":"VLOOKUP(M8,'Point Values'!$A:$B,2,FALSE)","v":0}]
{"$rows_left_out":21}
{"sheet":"Semi Pro","index":4,"n_rows":37,"n_cols":22,"rows_kept":37,"cut":false,"hidden":false,"merged":[[0,0,0,23],[36,0,36,21]]}
["SEMI PRO - 2018 WINTER HEAT POINTS"]
["CHAMPIONSHIP STANDING","CAR NUMBER","DRIVERS NAME",null,"TOTAL POINTS","2017-12-16","2017-12-17","2017-01-13","2018-01-13","2018-01-20","2018-01-20","2018-01-27","2018-02-03",null,"2017-12-16","2017-12-17","2017-01-13","2018-01-13","2018-01-20","2018-01-20","2018-01-27","2018-02-03"]
[1,"14","Vincent Midas",null,{"$f":"SUM(O3:V3)","v":673},2,3,1,3,4,13,2,1,null,{"$f":"VLOOKUP(F3,'Point Values'!$A:$B,2,FALSE)","v":97},{"$f":"VLOOKUP(G3,'Point Values'!$A:$B,2,FALSE)","v":94},{"$f":"VLOOKUP(H3,'Point Values'!$A:$B,2,FALSE)","v":100},{"$f":"VLOOKUP(I3,'Point Values'!$A:$B,2,FALSE)","v":94},{"$f":"VLOOKUP(J3,'Point Values'!$A:$B,2,FALSE)","v":91},0,{"$f":"VLOOKUP(L3,'Point Values'!$A:$B,2,FALSE)","v":97},{"$f":"VLOOKUP(M3,'Point Values'!$A:$B,2,FALSE)","v":100}]
[2,"12S","Sammy Smith",null,670,8,1,15,2,3,1,1,2,null,{"$f":"VLOOKUP(F4,'Point Values'!$A:$B,2,FALSE)","v":82},{"$f":"VLOOKUP(G4,'Point Values'!$A:$B,2,FALSE)","v":100},0,{"$f":"VLOOKUP(I4,'Point Values'!$A:$B,2,FALSE)","v":97},{"$f":"VLOOKUP(J4,'Point Values'!$A:$B,2,FALSE)","v":94},{"$f":"VLOOKUP(K4,'Point Values'!$A:$B,2,FALSE)","v":100},{"$f":"VLOOKUP(L4,'Point Values'!$A:$B,2,FALSE)","v":100},{"$f":"VLOOKUP(M4,'Point Values'!$A:$B,2,FALSE)","v":97}]
[3,"22","Carter Weedon",null,661,22,8,2,1,1,2,3,4,null,0,{"$f":"VLOOKUP(G5,'Point Values'!$A:$B,2,FALSE)","v":82},{"$f":"VLOOKUP(H5,'Point Values'!$A:$B,2,FALSE)","v":97},{"$f":"VLOOKUP(I5,'Point Values'!$A:$B,2,FALSE)","v":100},{"$f":"VLOOKUP(J5,'Point Values'!$A:$B,2,FALSE)","v":100},{"$f":"VLOOKUP(K5,'Point Values'!$A:$B,2,FALSE)","v":97},{"$f":"VLOOKUP(L5,'Point Values'!$A:$B,2,FALSE)","v":94},{"$f":"VLOOKUP(M5,'Point Values'!$A:$B,2,FALSE)","v":91}]
[4,"18H","Ryan Heim",null,629,1,6,5,6,".",4,7,3,null,{"$f":"VLOOKUP(F6,'Point Values'!$A:$B,2,FALSE)","v":100},{"$f":"VLOOKUP(G6,'Point Values'!$A:$B,2,FALSE)","v":86},{"$f":"VLOOKUP(H6,'Point Values'!$A:$B,2,FALSE)","v":88},{"$f":"VLOOKUP(I6,'Point Values'!$A:$B,2,FALSE)","v":86},{"$f":"VLOOKUP(J6,'Point Values'!$A:$B,2,FALSE)","v":0},{"$f":"VLOOKUP(K6,'Point Values'!$A:$B,2,FALSE)","v":91},{"$f":"VLOOKUP(L6,'Point Values'!$A:$B,2,FALSE)","v":84},{"$f":"VLOOKUP(M6,'Point Values'!$A:$B,2,FALSE)","v":94}]
[5,"27","Glenn Korner",null,613,10,7,3,4,5,3,9,8,null,0,{"$f":"VLOOKUP(G7,'Point Values'!$A:$B,2,FALSE)","v":84},{"$f":"VLOOKUP(H7,'Point Values'!$A:$B,2,FALSE)","v":94},{"$f":"VLOOKUP(I7,'Point Values'!$A:$B,2,FALSE)","v":91},{"$f":"VLOOKUP(J7,'Point Values'!$A:$B,2,FALSE)","v":88},{"$f":"VLOOKUP(K7,'Point Values'!$A:$B,2,FALSE)","v":94},{"$f":"VLOOKUP(L7,'Point Values'!$A:$B,2,FALSE)","v":80},{"$f":"VLOOKUP(M7,'Point Values'!$A:$B,2,FALSE)","v":82}]
[6,"08B","Craig Biryla",null,587,5,".",4,7,6,12,10,6,null,{"$f":"VLOOKUP(F8,'Point Values'!$A:$B,2,FALSE)","v":88},{"$f":"VLOOKUP(G8,'Point Values'!$A:$B,2,FALSE)","v":0},{"$f":"VLOOKUP(H8,'Point Values'!$A:$B,2,FALSE)","v":91},{"$f":"VLOOKUP(I8,'Point Values'!$A:$B,2,FALSE)","v":84},{"$f":"VLOOKUP(J8,'Point Values'!$A:$B,2,FALSE)","v":86},{"$f":"VLOOKUP(K8,'Point Values'!$A:$B,2,FALSE)","v":74},{"$f":"VLOOKUP(L8,'Point Values'!$A:$B,2,FALSE)","v":78},{"$f":"VLOOKUP(M8,'Point Values'!$A:$B,2,FALSE)","v":86}]
{"$rows_left_out":30}
{"sheet":"Masters","index":5,"n_rows":23,"n_cols":22,"rows_kept":23,"cut":false,"hidden":false,"merged":[[0,0,0,23],[22,0,22,21]]}
["MASTER - 2018 WINTER HEAT POINTS"]
["CHAMPIONSHIP STANDING","CAR NUMBER","DRIVERS NAME",null,"TOTAL POINTS","2017-12-16","2017-12-17","2017-01-13","2018-01-13","2018-01-20","2018-01-20","2018-01-27","2018-02-03",null,"2017-12-16","2017-12-17","2017-01-13","2018-01-13","2018-01-20","2018-01-20","2018-01-27","2018-02-03"]
[1,"58","Carl Cormier",null,{"$f":"SUM(O3:V3)","v":697},1,3,1,1,2,1,1,1,null,{"$f":"VLOOKUP(F3,'Point Values'!$A:$B,2,FALSE)","v":100},0,{"$f":"VLOOKUP(H3,'Point Values'!$A:$B,2,FALSE)","v":100},{"$f":"VLOOKUP(I3,'Point Values'!$A:$B,2,FALSE)","v":100},{"$f":"VLOOKUP(J3,'Point Values'!$A:$B,2,FALSE)","v":97},{"$f":"VLOOKUP(K3,'Point Values'!$A:$B,2,FALSE)","v":100},{"$f":"VLOOKUP(L3,'Point Values'!$A:$B,2,FALSE)","v":100},{"$f":"VLOOKUP(M3,'Point Values'!$A:$B,2,FALSE)","v":100}]
[2,"50","Todd Midas",null,{"$f":"SUM(O4:V4)","v":655},5,1,3,2,8,4,5,2,null,{"$f":"VLOOKUP(F4,'Point Values'!$A:$B,2,FALSE)","v":88},{"$f":"VLOOKUP(G4,'Point Values'!$A:$B,2,FALSE)","v":100},{"$f":"VLOOKUP(H4,'Point Values'!$A:$B,2,FALSE)","v":94},{"$f":"VLOOKUP(I4,'Point Values'!$A:$B,2,FALSE)","v":97},0,{"$f":"VLOOKUP(K4,'Point Values'!$A:$B,2,FALSE)","v":91},{"$f":"VLOOKUP(L4,'Point Values'!$A:$B,2,FALSE)","v":88},{"$f":"VLOOKUP(M4,'Point Values'!$A:$B,2,FALSE)","v":97}]
[3,"02","Sal Jimenez",null,{"$f":"SUM(O5:V5)","v":601},7,7,5,4,7,7,8,6,null,{"$f":"VLOOKUP(F5,'Point Values'!$A:$B,2,FALSE)","v":84},{"$f":"VLOOKUP(G5,'Point Values'!$A:$B,2,FALSE)","v":84},{"$f":"VLOOKUP(H5,'Point Values'!$A:$B,2,FALSE)","v":88},{"$f":"VLOOKUP(I5,'Point Values'!$A:$B,2,FALSE)","v":91},{"$f":"VLOOKUP(J5,'Point Values'!$A:$B,2,FALSE)","v":84},{"$f":"VLOOKUP(K5,'Point Values'!$A:$B,2,FALSE)","v":84},0,{"$f":"VLOOKUP(M5,'Point Values'!$A:$B,2,FALSE)","v":86}]
[4,22,"Dewayne Holder",null,{"$f":"SUM(O6:V6)","v":541},9,6,4,3,"DQ",5,4,4,null,0,{"$f":"VLOOKUP(G6,'Point Values'!$A:$B,2,FALSE)","v":86},{"$f":"VLOOKUP(H6,'Point Values'!$A:$B,2,FALSE)","v":91},{"$f":"VLOOKUP(I6,'Point Values'!$A:$B,2,FALSE)","v":94},{"$f":"VLOOKUP(J6,'Point Values'!$A:$B,2,FALSE)","v":0},{"$f":"VLOOKUP(K6,'Point Values'!$A:$B,2,FALSE)","v":88},{"$f":"VLOOKUP(L6,'Point Values'!$A:$B,2,FALSE)","v":91},{"$f":"VLOOKUP(M6,'Point Values'!$A:$B,2,FALSE)","v":91}]
[5,9,"Bob Conner",null,{"$f":"SUM(O7:V7)","v":527},".",".",2,5,5,9,6,5,null,{"$f":"VLOOKUP(F7,'Point Values'!$A:$B,2,FALSE)","v":0},{"$f":"VLOOKUP(G7,'Point Values'!$A:$B,2,FALSE)","v":0},{"$f":"VLOOKUP(H7,'Point Values'!$A:$B,2,FALSE)","v":97},{"$f":"VLOOKUP(I7,'Point Values'!$A:$B,2,FALSE)","v":88},{"$f":"VLOOKUP(J7,'Point Values'!$A:$B,2,FALSE)","v":88},{"$f":"VLOOKUP(K7,'Point Values'!$A:$B,2,FALSE)","v":80},{"$f":"VLOOKUP(L7,'Point Values'!$A:$B,2,FALSE)","v":86},{"$f":"VLOOKUP(M7,'Point Values'!$A:$B,2,FALSE)","v":88}]
[6,"36","Craig Bruce",null,{"$f":"SUM(O8:V8)","v":476},2,2,".",".",3,3,3,".",null,{"$f":"VLOOKUP(F8,'Point Values'!$A:$B,2,FALSE)","v":97},{"$f":"VLOOKUP(G8,'Point Values'!$A:$B,2,FALSE)","v":97},{"$f":"VLOOKUP(H8,'Point Values'!$A:$B,2,FALSE)","v":0},{"$f":"VLOOKUP(I8,'Point Values'!$A:$B,2,FALSE)","v":0},{"$f":"VLOOKUP(J8,'Point Values'!$A:$B,2,FALSE)","v":94},{"$f":"VLOOKUP(K8,'Point Values'!$A:$B,2,FALSE)","v":94},{"$f":"VLOOKUP(L8,'Point Values'!$A:$B,2,FALSE)","v":94},{"$f":"VLOOKUP(M8,'Point Values'!$A:$B,2,FALSE)","v":0}]
{"$rows_left_out":16}
{"sheet":"Pro","index":6,"n_rows":27,"n_cols":22,"rows_kept":27,"cut":false,"hidden":false,"merged":[[0,0,0,23],[26,0,26,21]]}
["PRO - 2018 WINTER HEAT POINTS"]
["CHAMPIONSHIP STANDING","CAR NUMBER","DRIVERS NAME",null,"TOTAL POINTS","2017-12-16","2017-12-17","2017-01-13","2018-01-13","2018-01-20","2018-01-20","2018-01-27","2018-02-03",null,"2017-12-16","2017-12-17","2017-01-13","2018-01-13","2018-01-20","2018-01-20","2018-01-27","2018-02-03"]
[1,"31","Noah Korner",null,{"$f":"SUM(O3:V3)","v":667},3,3,2,3,2,2,3,3,null,0,{"$f":"VLOOKUP(G3,'Point Values'!$A:$B,2,FALSE)","v":94},{"$f":"VLOOKUP(H3,'Point Values'!$A:$B,2,FALSE)","v":97},{"$f":"VLOOKUP(I3,'Point Values'!$A:$B,2,FALSE)","v":94},{"$f":"VLOOKUP(J3,'Point Values'!$A:$B,2,FALSE)","v":97},{"$f":"VLOOKUP(K3,'Point Values'!$A:$B,2,FALSE)","v":97},{"$f":"VLOOKUP(L3,'Point Values'!$A:$B,2,FALSE)","v":94},{"$f":"VLOOKUP(M3,'Point Values'!$A:$B,2,FALSE)","v":94}]
[2,"22","Sam Mayer",null,665,1,1,3,2,3,3,4,6,null,{"$f":"VLOOKUP(F4,'Point Values'!$A:$B,2,FALSE)","v":100},{"$f":"VLOOKUP(G4,'Point Values'!$A:$B,2,FALSE)","v":100},{"$f":"VLOOKUP(H4,'Point Values'!$A:$B,2,FALSE)","v":94},{"$f":"VLOOKUP(I4,'Point Values'!$A:$B,2,FALSE)","v":97},{"$f":"VLOOKUP(J4,'Point Values'!$A:$B,2,FALSE)","v":94},{"$f":"VLOOKUP(K4,'Point Values'!$A:$B,2,FALSE)","v":94},0,{"$f":"VLOOKUP(M4,'Point Values'!$A:$B,2,FALSE)","v":86}]
[3,"48","Dennis Lambert",null,581,".",".",1,1,1,1,2,7,null,{"$f":"VLOOKUP(F5,'Point Values'!$A:$B,2,FALSE)","v":0},{"$f":"VLOOKUP(G5,'Point Values'!$A:$B,2,FALSE)","v":0},{"$f":"VLOOKUP(H5,'Point Values'!$A:$B,2,FALSE)","v":100},{"$f":"VLOOKUP(I5,'Point Values'!$A:$B,2,FALSE)","v":100},{"$f":"VLOOKUP(J5,'Point Values'!$A:$B,2,FALSE)","v":100},{"$f":"VLOOKUP(K5,'Point Values'!$A:$B,2,FALSE)","v":100},{"$f":"VLOOKUP(L5,'Point Values'!$A:$B,2,FALSE)","v":97},{"$f":"VLOOKUP(M5,'Point Values'!$A:$B,2,FALSE)","v":84}]
[4,98,"Nick Sanchez",null,451,".",".",4,6,4,".",6,2,null,{"$f":"VLOOKUP(F6,'Point Values'!$A:$B,2,FALSE)","v":0},{"$f":"VLOOKUP(G6,'Point Values'!$A:$B,2,FALSE)","v":0},{"$f":"VLOOKUP(H6,'Point Values'!$A:$B,2,FALSE)","v":91},{"$f":"VLOOKUP(I6,'Point Values'!$A:$B,2,FALSE)","v":86},{"$f":"VLOOKUP(J6,'Point Values'!$A:$B,2,FALSE)","v":91},{"$f":"VLOOKUP(K6,'Point Values'!$A:$B,2,FALSE)","v":0},{"$f":"VLOOKUP(L6,'Point Values'!$A:$B,2,FALSE)","v":86},{"$f":"VLOOKUP(M6,'Point Values'!$A:$B,2,FALSE)","v":97}]
[5,"16","Jordan Lamothe",null,430,5,6,8,".",5,6,".",".",null,{"$f":"VLOOKUP(F7,'Point Values'!$A:$B,2,FALSE)","v":88},{"$f":"VLOOKUP(G7,'Point Values'!$A:$B,2,FALSE)","v":86},{"$f":"VLOOKUP(H7,'Point Values'!$A:$B,2,FALSE)","v":82},{"$f":"VLOOKUP(I7,'Point Values'!$A:$B,2,FALSE)","v":0},{"$f":"VLOOKUP(J7,'Point Values'!$A:$B,2,FALSE)","v":88},{"$f":"VLOOKUP(K7,'Point Values'!$A:$B,2,FALSE)","v":86},{"$f":"VLOOKUP(L7,'Point Values'!$A:$B,2,FALSE)","v":0},{"$f":"VLOOKUP(M7,'Point Values'!$A:$B,2,FALSE)","v":0}]
[6,"25","William Byron",null,275,".",".",".",".",7,4,1,".",null,{"$f":"VLOOKUP(F8,'Point Values'!$A:$B,2,FALSE)","v":0},{"$f":"VLOOKUP(G8,'Point Values'!$A:$B,2,FALSE)","v":0},{"$f":"VLOOKUP(H8,'Point Values'!$A:$B,2,FALSE)","v":0},{"$f":"VLOOKUP(I8,'Point Values'!$A:$B,2,FALSE)","v":0},{"$f":"VLOOKUP(J8,'Point Values'!$A:$B,2,FALSE)","v":84},{"$f":"VLOOKUP(K8,'Point Values'!$A:$B,2,FALSE)","v":91},{"$f":"VLOOKUP(L8,'Point Values'!$A:$B,2,FALSE)","v":100},{"$f":"VLOOKUP(M8,'Point Values'!$A:$B,2,FALSE)","v":0}]
{"$rows_left_out":20}
{"sheet":"Point Values","index":7,"n_rows":33,"n_cols":2,"rows_kept":33,"cut":false,"hidden":false,"merged":[]}
[1,100]
[2,97]
[3,94]
[4,91]
[5,88]
[6,86]
[7,84]
[8,82]
{"$rows_left_out":25}